BDBM50115519 4-[(Z)-(4-Bromophenyl)(ethoxyimino)methyl]-4'-methyl-1'-[(2-methyl-3-pyridinyl)carbonyl]-1,4'-bipiperidine::CHEMBL443999::{4-[(4-Bromo-phenyl)-ethoxyimino-methyl]-4'-methyl-[1,4']bipiperidinyl-1'-yl}-(2-methyl-pyridin-3-yl)-methanone
SMILES CCO\N=C(\C1CCN(CC1)C1(C)CCN(CC1)C(=O)c1cccnc1C)c1ccc(Br)cc1
InChI Key InChIKey=GXJXVSDXVMSAIP-QCWLDUFUSA-N
Data  1 KI
  Tab Delimited (TSV)   2D SDfile   Computed 3D by Vconf -m prep SDfile
Find this compound or compounds like it in BindingDB:
Activity Spreadsheet -- Enzyme Inhibition Constant Data from BindingDB
Found 1 hit for monomerid = 50115519
TargetC-C chemokine receptor type 5(Mus musculus)
Schering-Plough Research Institute
Curated by ChEMBL
LigandPNGBDBM50115519(4-[(Z)-(4-Bromophenyl)(ethoxyimino)methyl]-4'-meth...)
Affinity DataKi:  26nM. Assay description: Inhibition of RANTES binding to Chemokine receptor type 5 receptor from NIH 3T3 cells
In DepthDetails ArticlePubMed