BDBM50115973 CHEMBL3612151
SMILES CCN(CC)CCCn1c(=O)\c(=C\c2cc(OC)c(OC)c(OC)c2)s\c1=C1\C(=O)Nc2ccc(F)cc12
InChI Key InChIKey=IQVYMFJNYQXJOK-UBVVQDNHSA-N
Data  1 KI
  Tab Delimited (TSV)   2D SDfile   Computed 3D by Vconf -m prep SDfile
Find this compound or compounds like it in BindingDB:
Activity Spreadsheet -- Enzyme Inhibition Constant Data from BindingDB
Found 1 hit for monomerid = 50115973
TargetATP-dependent translocase ABCB1(Homo sapiens (Human))
The First Affiliated Hospital Of Dalian Medical University
Curated by ChEMBL
LigandPNGBDBM50115973(CHEMBL3612151)
Affinity DataKi:  120nM. Assay description: Inhibition of P-glycoprotein in human drug-resistant K562/ADR cells assessed as reduction in P-gp mediated rhodamine 123 efflux by spectrofluorometry
In DepthDetails ArticlePubMed