BDBM50116565 CHEMBL3608943
SMILES CC(C)[C@H]1c2ccc(F)cc2[C@@H](O)C[C@@]1(CCN(C)CCCc1nc2ccccc2[nH]1)OC(=O)C(C)C
InChI Key InChIKey=ITXUJDTVHQVSLI-BTIIJPOSSA-N
Data  2 IC50
  Tab Delimited (TSV)   2D SDfile   Computed 3D by Vconf -m prep SDfile
Find this compound or compounds like it in BindingDB:
Activity Spreadsheet -- Enzyme Inhibition Constant Data from BindingDB
Found 2 hits for monomerid = 50116565
TargetVoltage-dependent T-type calcium channel subunit alpha-1H(Homo sapiens (Human))
Actelion Pharmaceuticals
Curated by ChEMBL
LigandPNGBDBM50116565(CHEMBL3608943)
Affinity DataIC50:  76nM. Assay description: Inhibition of recombinant Cav3.2 channel (unknown origin) expressed in HEK293 cells assessed as effect on calcium flux incubated for 3 mins by FLIPR ...
In DepthDetails ArticlePubMed
TargetVoltage-dependent L-type calcium channel subunit alpha-1C(Homo sapiens (Human))
Actelion Pharmaceuticals
Curated by ChEMBL
LigandPNGBDBM50116565(CHEMBL3608943)
Affinity DataIC50:  426nM. Assay description: Inhibition of recombinant Cav1.2 channel (unknown origin) expressed in HEK293 cells assessed as effect on calcium flux incubated for 3 mins by FLIPR ...
In DepthDetails ArticlePubMed