BDBM50118539 CHEMBL136036::Diethyl-carbamic acid 5-thiophen-2-yl-6-oxa-10,10b-diaza-benzo[e]azulen-4-yl ester
SMILES CCN(CC)C(=O)OC1=C(Oc2cccnc2-n2cccc12)c1cccs1
InChI Key InChIKey=PFPMCHYEOUWMOR-UHFFFAOYSA-N
Data  1 KI
  Tab Delimited (TSV)   2D SDfile   Computed 3D by Vconf -m prep SDfile
Find this compound or compounds like it in BindingDB:
Activity Spreadsheet -- Enzyme Inhibition Constant Data from BindingDB
Found 1 hit for monomerid = 50118539
TargetTranslocator protein(Rattus norvegicus (rat))
Universita' Degli Studi Di Siena
Curated by ChEMBL
LigandPNGBDBM50118539(CHEMBL136036 | Diethyl-carbamic acid 5-thiophen-2-...)
Affinity DataKi:  0.230nM. Assay description: Inhibition of [3H]-PK11195 binding to Peripheral type benzodiazepine receptor (PBR) in rat cortex homogenate by 50%
In DepthDetails ArticlePubMed