BDBM50120429 CHEMBL3617965
SMILES Cc1c(cc(C(=O)NCCCN2CCCC2=O)c(=O)n1-c1cccc(c1)C(F)(F)F)[S+]([O-])c1ccc(cc1)C#N
InChI Key InChIKey=YDYDOJWRRZKZGN-UHFFFAOYSA-N
Data  1 IC50
  Tab Delimited (TSV)   2D SDfile   Computed 3D by Vconf -m prep SDfile
Find this compound or compounds like it in BindingDB:
Activity Spreadsheet -- Enzyme Inhibition Constant Data from BindingDB
Found 1 hit for monomerid = 50120429
TargetNeutrophil elastase(Homo sapiens (Human))
Bayer Healthcare
Curated by ChEMBL
LigandPNGBDBM50120429(CHEMBL3617965)
Affinity DataIC50:  0.5nM. Assay description: Inhibition of human neutrophil elastase
In DepthDetails ArticlePubMed