BDBM50120762 1-(2,7-Diphenyl-imidazo[1,2-a][1,3,5]triazin-4-ylamino)-propan-2-one::CHEMBL147893
SMILES CC(=O)CNc1nc(nc2nc(cn12)-c1ccccc1)-c1ccccc1
InChI Key InChIKey=GKXQLSQLVFHAIT-UHFFFAOYSA-N
Data  3 KI
  Tab Delimited (TSV)   2D SDfile   Computed 3D by Vconf -m prep SDfile
Find this compound or compounds like it in BindingDB:
Activity Spreadsheet -- Enzyme Inhibition Constant Data from BindingDB
Found 3 hits for monomerid = 50120762
TargetAdenosine receptor A3(Homo sapiens (Human))
Università
Curated by ChEMBL
LigandPNGBDBM50120762(1-(2,7-Diphenyl-imidazo[1,2-a][1,3,5]triazin-4-yla...)
Affinity DataKi:  5.80E+3nM. Assay description: Displacement of [125I]-AB-MECA from Adenosine A3 receptor in bovine cortical membranes in the presence of 20 nM DPCPX.
In DepthDetails ArticlePubMed
TargetAdenosine receptor A2a(Homo sapiens (Human))
Università
Curated by ChEMBL
LigandPNGBDBM50120762(1-(2,7-Diphenyl-imidazo[1,2-a][1,3,5]triazin-4-yla...)
Affinity DataKi: >1.00E+4nM. Assay description: Displacement of [3H]- CGS-21,680 from Adenosine A2a receptor in bovine striatal membranes.
In DepthDetails ArticlePubMed
TargetAdenosine receptor A1(BOVINE)
Università
Curated by ChEMBL
LigandPNGBDBM50120762(1-(2,7-Diphenyl-imidazo[1,2-a][1,3,5]triazin-4-yla...)
Affinity DataKi: >1.00E+4nM. Assay description: Displacement of [3H]-CHA from Adenosine A1 receptor in bovine cortical membranes.
In DepthDetails ArticlePubMed