BDBM50121452 (S)-2-{(S)-2-[(Benzyloxycarbonylamino-methyl)-hydroxy-phosphonium-methyl]-4-methyl-pentanoylamino}-4-methyl-pentanoic acid anion
SMILES CC(C)C[C@H](CP(O)([O-])=CNC(=O)OCc1ccccc1)C(=O)N[C@@H](CC(C)C)C([O-])=O
InChI Key InChIKey=NDJIIOVEMDNXIM-MOPGFXCFSA-M
Data  1 KI
  Tab Delimited (TSV)   2D SDfile   Computed 3D by Vconf -m prep SDfile
Find this compound or compounds like it in BindingDB:
Activity Spreadsheet -- Enzyme Inhibition Constant Data from BindingDB
Found 1 hit for monomerid = 50121452
TargetThermolysin(Bacillus thermoproteolyticus)
State University Of New York
Curated by ChEMBL
LigandPNGBDBM50121452((S)-2-{(S)-2-[(Benzyloxycarbonylamino-methyl)-hydr...)
Affinity DataKi:  11nM. Assay description: Competitive inhibition of thermolysin evaluated using the substrate FAGLA (Sigma); Competitive binding observed
In DepthDetails ArticlePubMed