BDBM50121644 2-({2-[2-Amino-3-(4-hydroxy-2,6-dimethyl-phenyl)-propionyl]-1,2,3,4-tetrahydro-isoquinoline-3-carbonyl}-amino)-succinamic acid
SMILES Cc1cc(O)cc(C)c1C[C@H](N)C(=O)N1Cc2ccccc2CC1C(=O)N[C@@H](CC(N)=O)C(O)=O
InChI Key InChIKey=GKMIMMIVGJGXPV-AHTKWCMKSA-N
Data  2 KI  1 IC50
  Tab Delimited (TSV)   2D SDfile   Computed 3D by Vconf -m prep SDfile
Find this compound or compounds like it in BindingDB:
Activity Spreadsheet -- Enzyme Inhibition Constant Data from BindingDB
Found 3 hits for monomerid = 50121644
TargetDelta-type opioid receptor(Rattus norvegicus (rat))
University Of Cagliari
Curated by ChEMBL
LigandPNGBDBM50121644(2-({2-[2-Amino-3-(4-hydroxy-2,6-dimethyl-phenyl)-p...)
Affinity DataKi:  1.10nM. Assay description: Inhibition of [3H]DPDPE binding to Opioid receptor delta 1 of rat brain P2 synaptosomes
In DepthDetails ArticlePubMed
TargetMu-type opioid receptor(Rattus norvegicus (rat))
University Of Cagliari
Curated by ChEMBL
LigandPNGBDBM50121644(2-({2-[2-Amino-3-(4-hydroxy-2,6-dimethyl-phenyl)-p...)
Affinity DataKi:  80.3nM. Assay description: Inhibition of [3H]DAGO binding to Opioid receptor mu 1 of rat brain P2 synaptosomes
In DepthDetails ArticlePubMed
TargetMu-type opioid receptor(GUINEA PIG)
University Of Cagliari
Curated by ChEMBL
LigandPNGBDBM50121644(2-({2-[2-Amino-3-(4-hydroxy-2,6-dimethyl-phenyl)-p...)
Affinity DataIC50: >1.00E+4nM. Assay description: In vitro inhibitory activity against electrically evoked contractions of guinea pig ileum (GPI)
In DepthDetails ArticlePubMed