BDBM50121949 CHEMBL3617300
SMILES Fc1ccc(cc1)S(=O)(=O)N1CCCc2cc(NC(=O)c3c(F)cccc3F)ccc12
InChI Key InChIKey=NJFVQXNOQFBVOF-UHFFFAOYSA-N
Data  1 EC50
  Tab Delimited (TSV)   2D SDfile   Computed 3D by Vconf -m prep SDfile
Find this compound or compounds like it in BindingDB:
Activity Spreadsheet -- Enzyme Inhibition Constant Data from BindingDB
Found 1 hit for monomerid = 50121949
TargetNuclear receptor ROR-gamma(Homo sapiens (Human))
Genentech
Curated by ChEMBL
LigandPNGBDBM50121949(CHEMBL3617300)
Affinity DataEC50: >1.00E+4nM. Assay description: Inverse agonist activity at N-terminal 6xHis-tagged human RORc ligand binding domain (241 to 486) expressed in bacterial expression system assessed a...
In DepthDetails ArticlePubMed