BDBM50122796 CHEMBL84798::[18-Carbamoylmethyl-14-(2,3-dihydro-naphthalen-1-ylmethyl)-8,17,20-trioxo-10-(4-phosphonomethyl-phenyl)-7,16,19-triaza-spiro[5.14]icos-11-en-9-yl]-acetic acid
SMILES NC(=O)C[C@@H]1NC(=O)C2(CCCCC2)NC(=O)[C@@H](CC(O)=O)[C@H](\C=C\C[C@@H](CC2=c3ccccc3=CCC2)CNC1=O)c1ccc(CP(O)(O)=O)cc1
InChI Key InChIKey=SZBXCUMMOMSDKH-FETINEJHSA-N
Data  1 IC50
  Tab Delimited (TSV)   2D SDfile   Computed 3D by Vconf -m prep SDfile
Find this compound or compounds like it in BindingDB:
Activity Spreadsheet -- Enzyme Inhibition Constant Data from BindingDB
Found 1 hit for monomerid = 50122796
TargetGrowth factor receptor-bound protein 2(Homo sapiens (Human))
National Cancer Institute-Frederick
Curated by ChEMBL
LigandPNGBDBM50122796(CHEMBL84798 | [18-Carbamoylmethyl-14-(2,3-dihydro-...)
Affinity DataIC50:  2nM. Assay description: Inhibition against Growth factor receptor bound protein 2 binding using ELISA technique
In DepthDetails ArticlePubMed