BDBM50123046 2-[4-(4-Hydroxy-3-isopropyl-phenoxy)-3,5-dimethyl-phenyl]-2H-[1,2,4]triazine-3,5-dione::CHEMBL125381::[4-(4-HYDROXY-3-ISOPROPYL-PHENOXY)-3,5-DIMETHYL-PHENYL]-6-AZAURACIL
SMILES CC(C)c1cc(Oc2c(C)cc(cc2C)-n2ncc(=O)[nH]c2=O)ccc1O
InChI Key InChIKey=RXQAVKWRCZYGMV-UHFFFAOYSA-N
Data  1 KI
PDB links: 1 PDB ID matches this monomer.
  Tab Delimited (TSV)   2D SDfile   Computed 3D by Vconf -m prep SDfile
Find this compound or compounds like it in BindingDB:
Activity Spreadsheet -- Enzyme Inhibition Constant Data from BindingDB
Found 1 hit for monomerid = 50123046
TargetThyroid hormone receptor beta(Homo sapiens (Human))
Pfizer
Curated by ChEMBL
LigandPNGBDBM50123046(2-[4-(4-Hydroxy-3-isopropyl-phenoxy)-3,5-dimethyl-...)
Affinity DataKi:  0.0300nM. Assay description: Inhibitory activity against [125I]-T3 binding to human TRbeta1 receptor