BDBM50124013 2-[(4-Fluoro-benzenesulfonyl)-methyl-amino]-N-(1-formyl-3-methyl-butyl)-3-methyl-butyramide::CHEMBL172051
SMILES CC(C)C[C@@H](NC(=O)[C@H](C(C)C)N(C)S(=O)(=O)c1ccc(F)cc1)C=O
InChI Key InChIKey=IGCIZAKSRNAXDY-WBVHZDCISA-N
Data  1 IC50
  Tab Delimited (TSV)   2D SDfile   Computed 3D by Vconf -m prep SDfile
Find this compound or compounds like it in BindingDB:
Activity Spreadsheet -- Enzyme Inhibition Constant Data from BindingDB
Found 1 hit for monomerid = 50124013
TargetCalpain-1 catalytic subunit(Homo sapiens (Human))
Senju Pharmaceutical
Curated by ChEMBL
LigandPNGBDBM50124013(2-[(4-Fluoro-benzenesulfonyl)-methyl-amino]-N-(1-f...)
Affinity DataIC50:  2.10E+4nM. Assay description: In vitro inhibition of porcine mu-calpain.
In DepthDetails ArticlePubMed