BDBM50125755 CHEMBL273787::N-[2-(7-{5-[8-(2-Acetylamino-ethyl)-naphthalen-2-yloxy]-pentyloxy}-naphthalen-1-yl)-ethyl]-acetamide
SMILES CC(=O)NCCc1cccc2ccc(OCCCCCOc3ccc4cccc(CCNC(C)=O)c4c3)cc12
InChI Key InChIKey=ZXCZVCUUILSBAR-UHFFFAOYSA-N
Data  2 KI
  Tab Delimited (TSV)   2D SDfile   Computed 3D by Vconf -m prep SDfile
Find this compound or compounds like it in BindingDB:
Activity Spreadsheet -- Enzyme Inhibition Constant Data from BindingDB
Found 2 hits for monomerid = 50125755
TargetMelatonin receptor type 1A(Homo sapiens (Human))
Université
Curated by ChEMBL
LigandPNGBDBM50125755(CHEMBL273787 | N-[2-(7-{5-[8-(2-Acetylamino-ethyl)...)
Affinity DataKi:  0.0500nM. Assay description: Binding affinity for human Melatonin receptor type 1A stably transfected in human embryonic kidney cells (HEK 293) using 2-[125I]-iodomelatonin as ra...
In DepthDetails ArticlePubMed
TargetMelatonin receptor type 1B(Homo sapiens (Human))
Université
Curated by ChEMBL
LigandPNGBDBM50125755(CHEMBL273787 | N-[2-(7-{5-[8-(2-Acetylamino-ethyl)...)
Affinity DataKi:  1.74nM. Assay description: Binding affinity for human Melatonin receptor type 1B stably transfected in human embryonic kidney cells (HEK 293) using 2-[125I]-iodomelatonin as ra...
In DepthDetails ArticlePubMed