BDBM50126678 2-[Benzyl-(2,4-dichloro-benzoyl)-amino]-3-phenyl-propionic acid::CHEMBL24489
SMILES OC(=O)[C@H](Cc1ccccc1)N(Cc1ccccc1)C(=O)c1ccc(Cl)cc1Cl
InChI Key InChIKey=DTTPNOZPVNDFEZ-UHFFFAOYSA-N
Data  1 IC50
  Tab Delimited (TSV)   2D SDfile   Computed 3D by Vconf -m prep SDfile
Find this compound or compounds like it in BindingDB:
Activity Spreadsheet -- Enzyme Inhibition Constant Data from BindingDB
Found 1 hit for monomerid = 50126678
TargetRNA-directed RNA polymerase(Hepatitis C virus)
Shire Biochem
Curated by ChEMBL
LigandPNGBDBM50126678(2-[Benzyl-(2,4-dichloro-benzoyl)-amino]-3-phenyl-p...)
Affinity DataIC50:  8.00E+3nM. Assay description: Inhibitory activity against Hepatitis C RNA dependent RNA polymerase Nonstructural protein 5B (NS5B polymerase) expressed from baculovirus-infected S...
In DepthDetails ArticlePubMed