BDBM50127153 (2,4-Diamino-7-phenyl-pteridin-6-yl)-phenyl-methanone::CHEMBL50597
SMILES Nc1nc(N)c2nc(C(=O)c3ccccc3)c(nc2n1)-c1ccccc1
InChI Key InChIKey=VGZGTXQZIBKACX-UHFFFAOYSA-N
Data  1 IC50
  Tab Delimited (TSV)   2D SDfile   Computed 3D by Vconf -m prep SDfile
Find this compound or compounds like it in BindingDB:
Activity Spreadsheet -- Enzyme Inhibition Constant Data from BindingDB
Found 1 hit for monomerid = 50127153
TargetBifunctional dihydrofolate reductase-thymidylate synthase(Toxoplasma gondii)
Harvard Medical School
Curated by ChEMBL
LigandPNGBDBM50127153((2,4-Diamino-7-phenyl-pteridin-6-yl)-phenyl-methan...)
Affinity DataIC50:  860nM. Assay description: Inhibitory activity against Dihydrohydrofolate reductase(DHFR) of Toxoplasma gondii
In DepthDetails ArticlePubMed