BDBM50127426 4-[(2-{4-[2-(2-tert-Butoxycarbonylamino-3-methyl-butyrylamino)-4-methylsulfanyl-butyrylamino]-3-hydroxy-6-methyl-heptanoylamino}-3-methyl-butyrylamino)-methyl]-benzoic acid::CHEMBL297913
SMILES CSCC[C@H](NC(=O)[C@@H](NC(=O)OC(C)(C)C)C(C)C)C(=O)NC(CC(C)C)[C@@H](O)CC(=O)N[C@H](C(C)C)C(=O)NCc1ccc(cc1)C(O)=O
InChI Key InChIKey=LARLJDMEHWHSJU-BGFUXUPTSA-N
Data  1 IC50
  Tab Delimited (TSV)   2D SDfile   Computed 3D by Vconf -m prep SDfile
Find this compound or compounds like it in BindingDB:
Activity Spreadsheet -- Enzyme Inhibition Constant Data from BindingDB
Found 1 hit for monomerid = 50127426
TargetBeta-secretase 1(Homo sapiens (Human))
Elan Pharmaceuticals
Curated by ChEMBL
LigandPNGBDBM50127426(4-[(2-{4-[2-(2-tert-Butoxycarbonylamino-3-methyl-b...)
Affinity DataIC50:  4.00E+3nM. Assay description: Inhibition of human beta-secretase (BACE) in MBP-C125 assay
In DepthDetails ArticlePubMed