BDBM50128300 CHEMBL55869::N-[1-(3,5-Dimethyl-benzoyl)-cyclohexyl]-3-methoxy-2-methyl-benzamide
SMILES COc1cccc(C(=O)NC2(CCCCC2)C(=O)c2cc(C)cc(C)c2)c1C
InChI Key InChIKey=SUAHMLFOJLHFHS-UHFFFAOYSA-N
Data  2 EC50
  Tab Delimited (TSV)   2D SDfile   Computed 3D by Vconf -m prep SDfile
Find this compound or compounds like it in BindingDB:
Activity Spreadsheet -- Enzyme Inhibition Constant Data from BindingDB
Found 2 hits for monomerid = 50128300
TargetEcdysone receptor(Choristoneura fumiferana)
Rheogene
Curated by ChEMBL
LigandPNGBDBM50128300(CHEMBL55869 | N-[1-(3,5-Dimethyl-benzoyl)-cyclohex...)
Affinity DataEC50:  1.11E+3nM. Assay description: Dose affording 50% of maximum transactivation for ecdysone receptor from Choristoneura fumiferana (CfEcR) and a luciferase reporter gene in CHO cells
In DepthDetails ArticlePubMed
TargetEcdysone receptor(Bombyx mori)
Rheogene
Curated by ChEMBL
LigandPNGBDBM50128300(CHEMBL55869 | N-[1-(3,5-Dimethyl-benzoyl)-cyclohex...)
Affinity DataEC50:  1.41E+3nM. Assay description: Dose affording 50% of maximum transactivation for ecdysone receptor from Bombyx mori (BmEcR) and a beta-galactosidase reporter gene in HEK-293 cell-l...
In DepthDetails ArticlePubMed