BDBM50128908 (2-Dimethylamino-ethyl)-carbamic acid (E)-(2S,3R)-2-(2,2-dimethyl-propionylamino)-3-hydroxy-octadec-4-enyl ester::CHEMBL418137
SMILES CCCCCCCCCCCCC\C=C\[C@@H](O)[C@H](COC(=O)NCCN(C)C)NC(=O)C(C)(C)C
InChI Key InChIKey=UAJCZBPGGHQBNM-QKTRXYFASA-N
Data  1 IC50
  Tab Delimited (TSV)   2D SDfile   Computed 3D by Vconf -m prep SDfile
Find this compound or compounds like it in BindingDB:
Activity Spreadsheet -- Enzyme Inhibition Constant Data from BindingDB
Found 1 hit for monomerid = 50128908
TargetSphingomyelin phosphodiesterase 2(Rattus norvegicus)
Taisho Pharmaceutical
Curated by ChEMBL
LigandPNGBDBM50128908((2-Dimethylamino-ethyl)-carbamic acid (E)-(2S,3R)-...)
Affinity DataIC50:  4.10E+3nM. Assay description: Inhibitory concentration against the membrane neutral magnesium-dependent Sphingomyelinase (N-SMase) using rat brain microsomes as the enzyme source
In DepthDetails ArticlePubMed