BDBM50130022 CHEMBL1885189
SMILES Cc1ccc(cc1)S(=O)(=O)NCC(=O)N1CCCCC1
InChI Key InChIKey=KMUVIXVGVWDDPQ-UHFFFAOYSA-N
Data  1 KI
  Tab Delimited (TSV)   2D SDfile   Computed 3D by Vconf -m prep SDfile
Find this compound or compounds like it in BindingDB:
Activity Spreadsheet -- Enzyme Inhibition Constant Data from BindingDB
Found 1 hit for monomerid = 50130022
TargetCarbonic anhydrase 2(Homo sapiens (Human))
Gebze Technical University
Curated by ChEMBL
LigandPNGBDBM50130022(CHEMBL1885189)
Affinity DataKi:  1.93E+4nM. Assay description: Inhibition of cytosolic carbonic anhydrase 2 esterase activity isolated from human erythrocytes using 4-nitrophenylacetate as substrate measured over...
In DepthDetails ArticlePubMed