BDBM50130282 CHEMBL13049::Naphthalene-1-sulfonic acid methyl-[1-methyl-3-(3-methyl-piperidin-1-yl)-propyl]-amide::R,R-Naphthalene-1-sulfonic acid methyl-[1-methyl-3-(3-methyl-piperidin-1-yl)-propyl]-amide::R-Naphthalene-1-sulfonic acid methyl-[1-methyl-3-(3-methyl-piperidin-1-yl)-propyl]-amide
SMILES CC(CCN1CCCC(C)C1)N(C)S(=O)(=O)c1cccc2ccccc12
InChI Key InChIKey=XZYWRBPKJXHPIN-UHFFFAOYSA-N
Data  3 KI
  Tab Delimited (TSV)   2D SDfile   Computed 3D by Vconf -m prep SDfile
Find this compound or compounds like it in BindingDB:
Activity Spreadsheet -- Enzyme Inhibition Constant Data from BindingDB
Found 3 hits for monomerid = 50130282
Target5-hydroxytryptamine receptor 7(Homo sapiens (Human))
Virginia Commonwealth University
Curated by ChEMBL
LigandPNGBDBM50130282(CHEMBL13049 | Naphthalene-1-sulfonic acid methyl-[...)
Affinity DataKi:  32nM. Assay description: Binding affinity towards human 5-hydroxytryptamine 7 receptor
In DepthDetails ArticlePubMed
Target5-hydroxytryptamine receptor 7(Homo sapiens (Human))
Virginia Commonwealth University
Curated by ChEMBL
LigandPNGBDBM50130282(CHEMBL13049 | Naphthalene-1-sulfonic acid methyl-[...)
Affinity DataKi:  32nM. Assay description: Binding affinity towards human 5-hydroxytryptamine 7 receptor
In DepthDetails ArticlePubMed
Target5-hydroxytryptamine receptor 7(Homo sapiens (Human))
Virginia Commonwealth University
Curated by ChEMBL
LigandPNGBDBM50130282(CHEMBL13049 | Naphthalene-1-sulfonic acid methyl-[...)
Affinity DataKi:  63nM. Assay description: Binding affinity towards cloned human 5-hydroxytryptamine 7 receptor in HEK 293 cells
In DepthDetails ArticlePubMed