BDBM50131048 CHEMBL3633590
SMILES CCCCCCOC(C)(C)[C@@H](O)COc1ccc(cc1C)C(CC)(CC)c1ccc(OC[C@@H](O)CO)c(C)c1
InChI Key InChIKey=REMWLTCCMVFNHB-IZEXYCQBSA-N
Data  1 EC50
  Tab Delimited (TSV)   2D SDfile   Computed 3D by Vconf -m prep SDfile
Find this compound or compounds like it in BindingDB:
Activity Spreadsheet -- Enzyme Inhibition Constant Data from BindingDB
Found 1 hit for monomerid = 50131048
TargetVitamin D3 receptor(Homo sapiens (Human))
National Institute Of Health Sciences
Curated by ChEMBL
LigandPNGBDBM50131048(CHEMBL3633590)
Affinity DataEC50:  1.50E+3nM. Assay description: Agonist activity at human VDR expressed in HEK293 cells co-expressing CMX-GAL4N and TK-MH100x4-LUC assessed as induction of transcriptional activity ...
In DepthDetails ArticlePubMed