BDBM50131060 CHEMBL3634186
SMILES Nc1nc(Cl)nc2n(cnc12)[C@@H]1O[C@H](COP(O)(=O)OP(O)(S)=O)[C@@H](O)[C@H]1O
InChI Key InChIKey=HCAOYDQLBKPHRD-UUOKFMHZSA-N
Data  2 EC50
  Tab Delimited (TSV)   2D SDfile   Computed 3D by Vconf -m prep SDfile
Find this compound or compounds like it in BindingDB:
Activity Spreadsheet -- Enzyme Inhibition Constant Data from BindingDB
Found 2 hits for monomerid = 50131060
TargetP2Y purinoceptor 11(Homo sapiens (Human))
Bar-Ilan University
Curated by ChEMBL
LigandPNGBDBM50131060(CHEMBL3634186)
Affinity DataEC50:  1.00E+3nM. Assay description: Agonist activity at GFP-tagged human P2Y11R transfected in human 1321N1 cells assessed as increase in intracellular Ca2+ level by fura 2/AM probe-bas...
In DepthDetails ArticlePubMed
TargetP2Y purinoceptor 1(Homo sapiens (Human))
Bar-Ilan University
Curated by ChEMBL
LigandPNGBDBM50131060(CHEMBL3634186)
Affinity DataEC50:  90nM. Assay description: Agonist activity at GFP-tagged human P2Y1R transfected in human 1321N1 cells assessed as increase in intracellular Ca2+ level by fura 2/AM probe-base...
In DepthDetails ArticlePubMed