BDBM50132589 CHEMBL3633952
SMILES Fc1ccccc1C(=O)N1CCCn2nc(COc3ccccc3)cc12
InChI Key InChIKey=XOQJPJSVYVFMJK-UHFFFAOYSA-N
Data  2 EC50
  Tab Delimited (TSV)   2D SDfile   Computed 3D by Vconf -m prep SDfile
Find this compound or compounds like it in BindingDB:
Activity Spreadsheet -- Enzyme Inhibition Constant Data from BindingDB
Found 2 hits for monomerid = 50132589
TargetMetabotropic glutamate receptor 5(Homo sapiens (Human))
Vanderbilt University Medical Center
Curated by ChEMBL
LigandPNGBDBM50132589(CHEMBL3633952)
Affinity DataEC50:  1.12E+3nM. Assay description: Displacement of [125I]NPY from rat-human hybrid NPY5 receptor expressed in CHO cells
In DepthDetails ArticlePubMed
TargetMetabotropic glutamate receptor 5(Homo sapiens (Human))
Vanderbilt University Medical Center
Curated by ChEMBL
LigandPNGBDBM50132589(CHEMBL3633952)
Affinity DataEC50:  1.13E+3nM. Assay description: In vitro binding affinity for PPAR-alpha
In DepthDetails ArticlePubMed