BDBM50132824 (S)-2-[(3-Bromo-benzyl)-(2,4-dichloro-benzenesulfonyl)-amino]-3-phenyl-propionic acid::CHEMBL113119
SMILES OC(=O)[C@H](Cc1ccccc1)N(Cc1cccc(Br)c1)S(=O)(=O)c1ccc(Cl)cc1Cl
InChI Key InChIKey=WUBWNVGFRGMGJW-FQEVSTJZSA-N
Data  1 IC50
  Tab Delimited (TSV)   2D SDfile   Computed 3D by Vconf -m prep SDfile
Find this compound or compounds like it in BindingDB:
Activity Spreadsheet -- Enzyme Inhibition Constant Data from BindingDB
Found 1 hit for monomerid = 50132824
TargetGenome polyprotein(Hepatitis C virus (HCV))
Shire Biochem
Curated by ChEMBL
LigandPNGBDBM50132824((S)-2-[(3-Bromo-benzyl)-(2,4-dichloro-benzenesulfo...)
Affinity DataIC50:  3.10E+4nM. Assay description: Inhibition of Hepatitis C RNA dependent RNA polymerase Nonstructural protein 5B activity.
In DepthDetails ArticlePubMed