BDBM50132833 (S)-2-[(3-Bromo-benzyl)-(3,4-dichloro-benzoyl)-amino]-3-phenyl-propionic acid::CHEMBL326276
SMILES OC(=O)[C@H](Cc1ccccc1)N(Cc1cccc(Br)c1)C(=O)c1ccc(Cl)c(Cl)c1
InChI Key InChIKey=FIGYBSUGANAILY-NRFANRHFSA-N
Data  1 IC50
  Tab Delimited (TSV)   2D SDfile   Computed 3D by Vconf -m prep SDfile
Find this compound or compounds like it in BindingDB:
Activity Spreadsheet -- Enzyme Inhibition Constant Data from BindingDB
Found 1 hit for monomerid = 50132833
TargetGenome polyprotein(Hepatitis C virus (HCV))
Shire Biochem
Curated by ChEMBL
LigandPNGBDBM50132833((S)-2-[(3-Bromo-benzyl)-(3,4-dichloro-benzoyl)-ami...)
Affinity DataIC50:  3.00E+4nM. Assay description: Inhibition of Hepatitis C RNA dependent RNA polymerase Nonstructural protein 5B activity.
In DepthDetails ArticlePubMed