BDBM50132837 (S)-2-[(3-Bromo-benzyl)-(4-chloro-2-methoxy-benzoyl)-amino]-3-phenyl-propionic acid::CHEMBL326939
SMILES COc1cc(Cl)ccc1C(=O)N(Cc1cccc(Br)c1)[C@@H](Cc1ccccc1)C(O)=O
InChI Key InChIKey=OQGUDXJTEBRIEF-NRFANRHFSA-N
Data  1 IC50
  Tab Delimited (TSV)   2D SDfile   Computed 3D by Vconf -m prep SDfile
Find this compound or compounds like it in BindingDB:
Activity Spreadsheet -- Enzyme Inhibition Constant Data from BindingDB
Found 1 hit for monomerid = 50132837
TargetGenome polyprotein(Hepatitis C virus (HCV))
Shire Biochem
Curated by ChEMBL
LigandPNGBDBM50132837((S)-2-[(3-Bromo-benzyl)-(4-chloro-2-methoxy-benzoy...)
Affinity DataIC50:  1.10E+4nM. Assay description: Inhibition of Hepatitis C RNA dependent RNA polymerase Nonstructural protein 5B activity.
In DepthDetails ArticlePubMed