BDBM50135733 7,9-Dichloro-1-propyl-1,4,5,6-tetrahydro-8-thia-1,2-diaza-cyclopenta[e]azulene::CHEMBL99085
SMILES CCCn1ncc2CCCc3c(Cl)sc(Cl)c3-c12
InChI Key InChIKey=AUVDDIGUWXARSE-UHFFFAOYSA-N
Data  2 KI
  Tab Delimited (TSV)   2D SDfile   Computed 3D by Vconf -m prep SDfile
Find this compound or compounds like it in BindingDB:
Activity Spreadsheet -- Enzyme Inhibition Constant Data from BindingDB
Found 2 hits for monomerid = 50135733
TargetD(4) dopamine receptor(Homo sapiens (Human))
Neurogen
Curated by ChEMBL
LigandPNGBDBM50135733(7,9-Dichloro-1-propyl-1,4,5,6-tetrahydro-8-thia-1,...)
Affinity DataKi:  3.55E+3nM. Assay description: Binding affinity to recombinant human dopamine receptor D4
In DepthDetails ArticlePubMed
TargetD(2) dopamine receptor(Homo sapiens (Human))
Neurogen
Curated by ChEMBL
LigandPNGBDBM50135733(7,9-Dichloro-1-propyl-1,4,5,6-tetrahydro-8-thia-1,...)
Affinity DataKi: >1.00E+4nM. Assay description: Binding affinity of the compound towards cloned human Dopamine receptor D2 was determined
In DepthDetails ArticlePubMed