BDBM50137241 5-Bromo-4-chloro-2-{[2-(4-chloro-phenyl)-5-oxo-oxazol-(4E)-ylidenemethyl]-amino}-benzoic acid::CHEMBL131492
SMILES OC(=O)c1cc(Br)c(Cl)cc1\N=C\c1nc(oc1O)-c1ccc(Cl)cc1
InChI Key InChIKey=KCWCZJMIWLELJW-QPSGOUHRSA-N
Data  1 IC50
  Tab Delimited (TSV)   2D SDfile   Computed 3D by Vconf -m prep SDfile
Find this compound or compounds like it in BindingDB:
Activity Spreadsheet -- Enzyme Inhibition Constant Data from BindingDB
Found 1 hit for monomerid = 50137241
TargetHolo-[acyl-carrier-protein] synthase(Bacillus subtilis)
Wyeth Research
Curated by ChEMBL
LigandPNGBDBM50137241(5-Bromo-4-chloro-2-{[2-(4-chloro-phenyl)-5-oxo-oxa...)
Affinity DataIC50: >2.00E+4nM. Assay description: In vitro inhibitory activity against Holo-[acyl-carrier-protein] synthase was determined using Bacillus subtilis GST-Acp-HTRFassay
In DepthDetails ArticlePubMed