BDBM50137469 2-Benzoyl-1-cyclohexyl-1H-benzoimidazole-5-carboxylic acid::CHEMBL174053
SMILES OC(=O)c1ccc2n(C3CCCCC3)c(nc2c1)C(=O)c1ccccc1
InChI Key InChIKey=WOILRKOBFRPLGV-UHFFFAOYSA-N
Data  1 IC50
  Tab Delimited (TSV)   2D SDfile   Computed 3D by Vconf -m prep SDfile
Find this compound or compounds like it in BindingDB:
Activity Spreadsheet -- Enzyme Inhibition Constant Data from BindingDB
Found 1 hit for monomerid = 50137469
TargetRNA-directed RNA polymerase(Hepatitis C virus)
Boehringer Ingelheim (Canada)
Curated by ChEMBL
LigandPNGBDBM50137469(2-Benzoyl-1-cyclohexyl-1H-benzoimidazole-5-carboxy...)
Affinity DataIC50:  4.40E+4nM. Assay description: Inhibitory activity against NS5B polymerase of hepatitis C virus
In DepthDetails ArticlePubMed