BDBM50138053 CHEMBL3753788
SMILES COCCCC1(CCC1)[C@H](O)\C=C\[C@H]1COC(=O)N1CCSc1nc(cs1)C(O)=O
InChI Key InChIKey=FEYUNKQIAFSCKX-WIJLQKJISA-N
Data  1 KI  3 EC50
  Tab Delimited (TSV)   2D SDfile   Computed 3D by Vconf -m prep SDfile
Find this compound or compounds like it in BindingDB:
Activity Spreadsheet -- Enzyme Inhibition Constant Data from BindingDB
Found 4 hits for monomerid = 50138053
TargetProstaglandin E2 receptor EP1 subtype(Homo sapiens (Human))
Ono Pharmaceutical
Curated by ChEMBL
LigandPNGBDBM50138053(CHEMBL3753788)
Affinity DataKi: >1.00E+4nM. Assay description: Binding affinity to human EP1 receptor
In DepthDetails ArticlePubMed
TargetProstaglandin E2 receptor EP3 subtype(Homo sapiens (Human))
Ono Pharmaceutical
Curated by ChEMBL
LigandPNGBDBM50138053(CHEMBL3753788)
Affinity DataEC50:  25nM. Assay description: Agonist activity at human EP3 receptor
In DepthDetails ArticlePubMed
TargetProstaglandin E2 receptor EP4 subtype(Homo sapiens (Human))
Ono Pharmaceutical
Curated by ChEMBL
LigandPNGBDBM50138053(CHEMBL3753788)
Affinity DataEC50:  705nM. Assay description: Agonist activity at human EP4 receptor
In DepthDetails ArticlePubMed
TargetProstaglandin E2 receptor EP2 subtype(Homo sapiens (Human))
Ono Pharmaceutical
Curated by ChEMBL
LigandPNGBDBM50138053(CHEMBL3753788)
Affinity DataEC50:  18nM. Assay description: Agonist activity at human EP2 receptor
In DepthDetails ArticlePubMed