BDBM50139517 CHEMBL352181::N-{4-[3-(2-Pyrrolidin-1-yl-ethyl)-1H-indol-5-yl]-3,6-dihydro-2H-pyridin-1-yl}-thiobenzamide
SMILES S=C(NN1CCC(=CC1)c1ccc2[nH]cc(CCN3CCCC3)c2c1)c1ccccc1
InChI Key InChIKey=ACAQTMICMMVXHA-UHFFFAOYSA-N
Data  2 KI
  Tab Delimited (TSV)   2D SDfile   Computed 3D by Vconf -m prep SDfile
Find this compound or compounds like it in BindingDB:
Activity Spreadsheet -- Enzyme Inhibition Constant Data from BindingDB
Found 2 hits for monomerid = 50139517
Target5-hydroxytryptamine receptor 1D(Homo sapiens (Human))
Nps Pharmaceuticals
Curated by ChEMBL
LigandPNGBDBM50139517(CHEMBL352181 | N-{4-[3-(2-Pyrrolidin-1-yl-ethyl)-1...)
Affinity DataKi:  9.5nM. Assay description: Binding affinity of the compound was evaluated at the cloned human 5-hydroxytryptamine 1D receptor
In DepthDetails ArticlePubMed
Target5-hydroxytryptamine receptor 1B(Homo sapiens (Human))
Nps Pharmaceuticals
Curated by ChEMBL
LigandPNGBDBM50139517(CHEMBL352181 | N-{4-[3-(2-Pyrrolidin-1-yl-ethyl)-1...)
Affinity DataKi:  68nM. Assay description: Binding affinity of the compound was evaluated at the cloned human 5-hydroxytryptamine 1B receptor
In DepthDetails ArticlePubMed