BDBM50139682 3-[(4-Chloro-benzoyl)-methyl-amino]-5-phenyl-thiophene-2-carboxylic acid::CHEMBL424194
SMILES CN(C(=O)c1ccc(Cl)cc1)c1cc(sc1C(O)=O)-c1ccccc1
InChI Key InChIKey=RYHAJFGPWHUPHK-UHFFFAOYSA-N
Data  1 IC50
  Tab Delimited (TSV)   2D SDfile   Computed 3D by Vconf -m prep SDfile
Find this compound or compounds like it in BindingDB:
Activity Spreadsheet -- Enzyme Inhibition Constant Data from BindingDB
Found 1 hit for monomerid = 50139682
TargetGenome polyprotein(Hepatitis C virus (HCV))
Shire Biochem
Curated by ChEMBL
LigandPNGBDBM50139682(3-[(4-Chloro-benzoyl)-methyl-amino]-5-phenyl-thiop...)
Affinity DataIC50:  1.20E+3nM. Assay description: In vitro inhibition of Hepatitis C polymerase.
In DepthDetails ArticlePubMed