BDBM50140789 1-(2-Bromo-phenyl)-3-(4-chloro-3-cyano-2-hydroxy-phenyl)-urea::CHEMBL26830
SMILES Oc1c(NC(=O)Nc2ccccc2Br)ccc(Cl)c1C#N
InChI Key InChIKey=ARQRXWXRYLWRTM-UHFFFAOYSA-N
Data  2 IC50
  Tab Delimited (TSV)   2D SDfile   Computed 3D by Vconf -m prep SDfile
Find this compound or compounds like it in BindingDB:
Activity Spreadsheet -- Enzyme Inhibition Constant Data from BindingDB
Found 2 hits for monomerid = 50140789
TargetC-X-C chemokine receptor type 1(Homo sapiens (Human))
Glaxosmithkline
Curated by ChEMBL
LigandPNGBDBM50140789(1-(2-Bromo-phenyl)-3-(4-chloro-3-cyano-2-hydroxy-p...)
Affinity DataIC50:  1.11E+4nM. Assay description: Inhibition of binding of IL-8 to membranes of cloned CXC chemokine receptor 1 expressed in CHO Cells using [125I]-IL-8 radioligand
In DepthDetails ArticlePubMed
TargetC-X-C chemokine receptor type 2(Homo sapiens (Human))
Glaxosmithkline
Curated by ChEMBL
LigandPNGBDBM50140789(1-(2-Bromo-phenyl)-3-(4-chloro-3-cyano-2-hydroxy-p...)
Affinity DataIC50:  57nM. Assay description: Inhibition of binding of IL-8 to membranes of cloned CXC chemokine receptor 2 expressed in CHO Cells using [125I]-IL-8 radioligand
In DepthDetails ArticlePubMed