BDBM50142807 4-[1'-(2-Chloro-benzoyl)-[1,4']bipiperidinyl-4-ylmethyl]-N-isopropyl-benzamide::CHEMBL50998
SMILES CC(C)NC(=O)c1ccc(CC2CCN(CC2)C2CCN(CC2)C(=O)c2ccccc2Cl)cc1
InChI Key InChIKey=SBDDPCLSOLRMJB-UHFFFAOYSA-N
Data  1 KI
  Tab Delimited (TSV)   2D SDfile   Computed 3D by Vconf -m prep SDfile
Find this compound or compounds like it in BindingDB:
Activity Spreadsheet -- Enzyme Inhibition Constant Data from BindingDB
Found 1 hit for monomerid = 50142807
TargetMuscarinic acetylcholine receptor M2(Homo sapiens (Human))
Schering-Plough Research Institute
Curated by ChEMBL
LigandPNGBDBM50142807(4-[1'-(2-Chloro-benzoyl)-[1,4']bipiperidinyl-4-ylm...)
Affinity DataKi:  12nM. Assay description: Binding affinity against cloned human muscarinic acetylcholine receptor M2.
In DepthDetails ArticlePubMed