BDBM50143710 8-(2-{[2-(2,5-Dichloro-phenylamino)-ethyl]-methyl-amino}-ethyl)-8-aza-spiro[4.5]decane-7,9-dione::CHEMBL55460
SMILES CN(CCNc1cc(Cl)ccc1Cl)CCN1C(=O)CC2(CCCC2)CC1=O
InChI Key InChIKey=CAFBNEJZNQABOY-UHFFFAOYSA-N
Data  2 KI
  Tab Delimited (TSV)   2D SDfile   Computed 3D by Vconf -m prep SDfile
Find this compound or compounds like it in BindingDB:
Activity Spreadsheet -- Enzyme Inhibition Constant Data from BindingDB
Found 2 hits for monomerid = 50143710
TargetAlpha-1D adrenergic receptor(Rattus norvegicus (Rat))
Recordati
Curated by ChEMBL
LigandPNGBDBM50143710(8-(2-{[2-(2,5-Dichloro-phenylamino)-ethyl]-methyl-...)
Affinity DataKi:  674nM. Assay description: Binding affinity to the adrenergic receptor alpha-1D of rat aorta
In DepthDetails ArticlePubMed
Target5-hydroxytryptamine receptor 1A(Homo sapiens (Human))
Recordati
Curated by ChEMBL
LigandPNGBDBM50143710(8-(2-{[2-(2,5-Dichloro-phenylamino)-ethyl]-methyl-...)
Affinity DataKi:  717nM. Assay description: Binding affinity to human 5-hydroxytryptamine 1A receptor was measured using [3H]-8-hydroxy-2-(di-n-propylamine) tetraline [3H]-8-OH-DPAT) as radioli...
In DepthDetails ArticlePubMed