BDBM50144474 4-{[Benzyl-(3-methanesulfonylamino-2-methyl-phenyl)-amino]-methyl}-benzoic acid methyl ester::CHEMBL420742
SMILES COC(=O)c1ccc(CN(Cc2ccccc2)c2cccc(NS(C)(=O)=O)c2C)cc1
InChI Key InChIKey=GXTYCQMYWOWVJG-UHFFFAOYSA-N
Data  1 IC50
  Tab Delimited (TSV)   2D SDfile   Computed 3D by Vconf -m prep SDfile
Find this compound or compounds like it in BindingDB:
Activity Spreadsheet -- Enzyme Inhibition Constant Data from BindingDB
Found 1 hit for monomerid = 50144474
TargetGlucocorticoid receptor(Homo sapiens (Human))
Abbott Laboratories
Curated by ChEMBL
LigandPNGBDBM50144474(4-{[Benzyl-(3-methanesulfonylamino-2-methyl-phenyl...)
Affinity DataIC50:  470nM. Assay description: Binding affinity against human Glucocorticoid receptor (GR) using [3H]-dexamethasone as radioligand
In DepthDetails ArticlePubMed