BDBM50145109 (2S)-2-{[(2R)-1-{[(4S,7R,13R,16S)-13-benzyl-7-(carbamoylmethyl)-10-ethyl-16-[(4-hydroxyphenyl)methyl]-6,9,12,15,18-pentaoxo-1,2-dithia-5,8,11,14,17-pentaazacycloicosan-4-yl]carbonyl}pyrrolidin-2-yl]formamido}-N-(carbamoylmethyl)-5-[(diaminomethylidene)amino]pentanamide::CHEMBL408829
SMILES CCC1NC(=O)[C@@H](Cc2ccccc2)NC(=O)[C@H](Cc2ccc(O)cc2)NC(=O)CCSSC[C@@H](NC(=O)[C@@H](CC(N)=O)NC1=O)C(=O)N1CCC[C@@H]1C(=O)N[C@@H](CCCNC(N)=N)C(=O)NCC(N)=O
InChI Key InChIKey=WCFGKLIUCGTZLO-QGLPFIHPSA-N
Data  4 KI
  Tab Delimited (TSV)   2D SDfile   Computed 3D by Vconf -m prep SDfile
Find this compound or compounds like it in BindingDB:
Activity Spreadsheet -- Enzyme Inhibition Constant Data from BindingDB
Found 4 hits for monomerid = 50145109
TargetVasopressin V1b receptor(Homo sapiens (Human))
Medical College Of Ohio
Curated by ChEMBL
LigandPNGBDBM50145109((2S)-2-{[(2R)-1-{[(4S,7R,13R,16S)-13-benzyl-7-(car...)
Affinity DataKi:  1.20nM. Assay description: Binding affinity against human vasopressin V1b receptor was determined by using plasma membranes from CHO cells stably transfected with VP/OT recepto...
In DepthDetails ArticlePubMed
TargetVasopressin V2 receptor(Homo sapiens (Human))
Medical College Of Ohio
Curated by ChEMBL
LigandPNGBDBM50145109((2S)-2-{[(2R)-1-{[(4S,7R,13R,16S)-13-benzyl-7-(car...)
Affinity DataKi:  2.10nM. Assay description: Binding affinity against human vasopressin V2 receptor was determined by using plasma membranes from CHO cells stably transfected with VP/OT receptor...
In DepthDetails ArticlePubMed
TargetVasopressin V1a receptor(Homo sapiens (Human))
Medical College Of Ohio
Curated by ChEMBL
LigandPNGBDBM50145109((2S)-2-{[(2R)-1-{[(4S,7R,13R,16S)-13-benzyl-7-(car...)
Affinity DataKi:  19.7nM. Assay description: Binding affinity against human vasopressin V1a receptor was determined by using plasma membranes from CHO cells stably transfected with VP/OT recepto...
In DepthDetails ArticlePubMed
TargetOxytocin receptor(Homo sapiens (Human))
Medical College Of Ohio
Curated by ChEMBL
LigandPNGBDBM50145109((2S)-2-{[(2R)-1-{[(4S,7R,13R,16S)-13-benzyl-7-(car...)
Affinity DataKi:  224nM. Assay description: Binding affinity against human oxytocin receptor was determined by using plasma membranes from CHO cells stably transfected with VP/OT receptors
In DepthDetails ArticlePubMed