BDBM50146524 (S)-3-(S)-Hydroxy-4-{(S)-3-methyl-2-[2-(naphthalen-2-yloxy)-acetylamino]-pentanoylamino}-5-phenyl-pentanoic acid butylamide::CHEMBL3215351::CHEMBL98384
SMILES CCCCNC(=O)C[C@H](O)[C@H](Cc1ccccc1)NC(=O)[C@@H](NC(=O)COc1ccc2ccccc2c1)[C@@H](C)CC
InChI Key InChIKey=DFWWIDHDAIZSDT-JTWCMULTSA-N
Data  1 KI
  Tab Delimited (TSV)   2D SDfile   Computed 3D by Vconf -m prep SDfile
Find this compound or compounds like it in BindingDB:
Activity Spreadsheet -- Enzyme Inhibition Constant Data from BindingDB
Found 1 hit for monomerid = 50146524
TargetPlasmepsin II(Plasmodium falciparum)
University Of Milan
Curated by ChEMBL
LigandPNGBDBM50146524((S)-3-(S)-Hydroxy-4-{(S)-3-methyl-2-[2-(naphthalen...)
Affinity DataKi:  110nM. Assay description: In vitro binding affinity towards Plasmodium falciparum plasmepsin-2
In DepthDetails ArticlePubMed