BDBM50146647 (S)-((S)-1-Carboxymethyl-2-oxo-5-phenyl-2,3,4,5-tetrahydro-1H-benzo[e][1,4]diazepin-5-yl)-(4,6-dimethyl-pyrimidin-2-yloxy)-acetic acid::CHEMBL313867
SMILES Cc1cc(C)nc(O[C@H](C(O)=O)[C@]2(NCC(=O)N(CC(O)=O)c3ccccc23)c2ccccc2)n1
InChI Key InChIKey=JKNAAXSOIGHTLX-RDGATRHJSA-N
Data  2 IC50
  Tab Delimited (TSV)   2D SDfile   Computed 3D by Vconf -m prep SDfile
Find this compound or compounds like it in BindingDB:
Activity Spreadsheet -- Enzyme Inhibition Constant Data from BindingDB
Found 2 hits for monomerid = 50146647
TargetEndothelin-1 receptor(Homo sapiens (Human))
Actelion Pharmaceuticals
Curated by ChEMBL
LigandPNGBDBM50146647((S)-((S)-1-Carboxymethyl-2-oxo-5-phenyl-2,3,4,5-te...)
Affinity DataIC50:  13nM. Assay description: Antagonist activity towards human recombinant Endothelin A receptor expressed in chinese hamster ovary (CHO) cells determined using [125I]-ET-1 as ra...
In DepthDetails ArticlePubMed
TargetEndothelin receptor type B(Homo sapiens (Human))
Actelion Pharmaceuticals
Curated by ChEMBL
LigandPNGBDBM50146647((S)-((S)-1-Carboxymethyl-2-oxo-5-phenyl-2,3,4,5-te...)
Affinity DataIC50:  558nM. Assay description: Antagonist activity towards human recombinant Endothelin B receptor expressed in chinese hamster ovary (CHO) cells determined using [125I]-ET-1 as ra...
In DepthDetails ArticlePubMed