BDBM50146679 (S)-[(S)-5-Biphenyl-3-yl-2-oxo-1-(2,4,6-trifluoro-benzyl)-2,3,4,5-tetrahydro-1H-benzo[e][1,4]diazepin-5-yl]-(4,6-dimethyl-pyrimidin-2-yloxy)-acetic acid::CHEMBL319754
SMILES Cc1cc(C)nc(O[C@H](C(O)=O)[C@]2(NCC(=O)N(Cc3c(F)cc(F)cc3F)c3ccccc23)c2cccc(c2)-c2ccccc2)n1
InChI Key InChIKey=VEMZPXZQLOLLKQ-ILFWFZRHSA-N
Data  5 IC50
  Tab Delimited (TSV)   2D SDfile   Computed 3D by Vconf -m prep SDfile
Find this compound or compounds like it in BindingDB:
Activity Spreadsheet -- Enzyme Inhibition Constant Data from BindingDB
Found 5 hits for monomerid = 50146679
TargetCytochrome P450 2C9(Homo sapiens (Human))
Actelion Pharmaceuticals
Curated by ChEMBL
LigandPNGBDBM50146679((S)-[(S)-5-Biphenyl-3-yl-2-oxo-1-(2,4,6-trifluoro-...)
Affinity DataIC50:  2.80E+4nM. Assay description: Inhibition of human cytochrome P450 2C9
In DepthDetails ArticlePubMed
TargetCytochrome P450 2D6(Homo sapiens (Human))
Actelion Pharmaceuticals
Curated by ChEMBL
LigandPNGBDBM50146679((S)-[(S)-5-Biphenyl-3-yl-2-oxo-1-(2,4,6-trifluoro-...)
Affinity DataIC50: >5.00E+4nM. Assay description: Inhibition of human cytochrome P450 2D6
In DepthDetails ArticlePubMed
TargetEndothelin receptor type B(Homo sapiens (Human))
Actelion Pharmaceuticals
Curated by ChEMBL
LigandPNGBDBM50146679((S)-[(S)-5-Biphenyl-3-yl-2-oxo-1-(2,4,6-trifluoro-...)
Affinity DataIC50:  89.8nM. Assay description: Antagonist activity towards human recombinant Endothelin B receptor expressed in chinese hamster ovary (CHO) cells determined using [125I]-ET-1 as ra...
In DepthDetails ArticlePubMed
TargetEndothelin-1 receptor(Homo sapiens (Human))
Actelion Pharmaceuticals
Curated by ChEMBL
LigandPNGBDBM50146679((S)-[(S)-5-Biphenyl-3-yl-2-oxo-1-(2,4,6-trifluoro-...)
Affinity DataIC50:  7.90nM. Assay description: Antagonist activity towards human recombinant Endothelin A receptor expressed in chinese hamster ovary (CHO) cells determined using [125I]-ET-1 as ra...
In DepthDetails ArticlePubMed
TargetCytochrome P450 3A4(Homo sapiens (Human))
Actelion Pharmaceuticals
Curated by ChEMBL
LigandPNGBDBM50146679((S)-[(S)-5-Biphenyl-3-yl-2-oxo-1-(2,4,6-trifluoro-...)
Affinity DataIC50:  7.00E+3nM. Assay description: Inhibition of human cytochrome P450 3A4
In DepthDetails ArticlePubMed