BDBM50147131 CHEMBL104248::Ethanesulfonic acid (3-benzoyl-phenyl)-pyridin-3-ylmethyl-amide
SMILES CCS(=O)(=O)N(Cc1cccnc1)c1cccc(c1)C(=O)c1ccccc1
InChI Key InChIKey=LQTKARGCSZFLNO-UHFFFAOYSA-N
Data  1 EC50
  Tab Delimited (TSV)   2D SDfile   Computed 3D by Vconf -m prep SDfile
Find this compound or compounds like it in BindingDB:
Activity Spreadsheet -- Enzyme Inhibition Constant Data from BindingDB
Found 1 hit for monomerid = 50147131
TargetMetabotropic glutamate receptor 2(Homo sapiens (Human))
Eli Lilly
Curated by ChEMBL
LigandPNGBDBM50147131(CHEMBL104248 | Ethanesulfonic acid (3-benzoyl-phen...)
Affinity DataEC50:  1.10E+3nM. Assay description: Effective concentration against metabotropic glutamate receptor 2
In DepthDetails ArticlePubMed