BDBM50148422 4-[(3-Phosphono-propylamino)-methyl]-benzoic acid heptyl ester::CHEMBL117403
SMILES CCCCCCCOC(=O)c1ccc(CNCCCP(O)(O)=O)cc1
InChI Key InChIKey=POPQMXAKAVJFNJ-UHFFFAOYSA-N
Data  5 IC50
  Tab Delimited (TSV)   2D SDfile   Computed 3D by Vconf -m prep SDfile
Find this compound or compounds like it in BindingDB:
Activity Spreadsheet -- Enzyme Inhibition Constant Data from BindingDB
Found 5 hits for monomerid = 50148422
TargetLysophosphatidic acid receptor 2(Homo sapiens (Human))
Merck Research Laboratories
Curated by ChEMBL
LigandPNGBDBM50148422(4-[(3-Phosphono-propylamino)-methyl]-benzoic acid ...)
Affinity DataIC50:  700nM. Assay description: Binding affinity to human sphingosine 1-phosphate receptor 4 expressed in CHO cells was determined by using [33P]-S1P as radioligand
In DepthDetails ArticlePubMed
TargetSphingosine 1-phosphate receptor 1(Homo sapiens (Human))
Merck Research Laboratories
Curated by ChEMBL
LigandPNGBDBM50148422(4-[(3-Phosphono-propylamino)-methyl]-benzoic acid ...)
Affinity DataIC50:  2.30nM. Assay description: Binding affinity to human sphingosine 1-phosphate receptor 1 expressed in CHO cells was determined by using [33P]-S1P as radioligand
In DepthDetails ArticlePubMed
TargetSphingosine 1-phosphate receptor 2(Homo sapiens (Human))
Merck Research Laboratories
Curated by ChEMBL
LigandPNGBDBM50148422(4-[(3-Phosphono-propylamino)-methyl]-benzoic acid ...)
Affinity DataIC50:  680nM. Assay description: Binding affinity to human sphingosine 1-phosphate receptor 2 expressed in CHO cells was determined by using [33P]-S1P as radioligand
In DepthDetails ArticlePubMed
TargetSphingosine 1-phosphate receptor 3(Homo sapiens (Human))
Merck Research Laboratories
Curated by ChEMBL
LigandPNGBDBM50148422(4-[(3-Phosphono-propylamino)-methyl]-benzoic acid ...)
Affinity DataIC50:  280nM. Assay description: Binding affinity to human sphingosine 1-phosphate receptor 3 expressed in CHO cells was determined by using [33P]-S1P as radioligand
In DepthDetails ArticlePubMed
TargetSphingosine 1-phosphate receptor 2(Homo sapiens (Human))
Merck Research Laboratories
Curated by ChEMBL
LigandPNGBDBM50148422(4-[(3-Phosphono-propylamino)-methyl]-benzoic acid ...)
Affinity DataIC50: >1.00E+4nM. Assay description: Binding affinity to human sphingosine 1-phosphate receptor 2 expressed in CHO cells was determined by using [33P]-S1P as radioligand
In DepthDetails ArticlePubMed