BDBM50149555 CHEMBL3770278
SMILES CC(C)Oc1ccc(cc1Cl)-c1nnc(s1)-n1nc(C)c(CC(O)=O)c1C
InChI Key InChIKey=AJIKYUOKNHOLKA-UHFFFAOYSA-N
Data  3 EC50
  Tab Delimited (TSV)   2D SDfile   Computed 3D by Vconf -m prep SDfile
Find this compound or compounds like it in BindingDB:
Activity Spreadsheet -- Enzyme Inhibition Constant Data from BindingDB
Found 3 hits for monomerid = 50149555
TargetSphingosine 1-phosphate receptor 1(Homo sapiens (Human))
Glaxosmithkline
Curated by ChEMBL
LigandPNGBDBM50149555(CHEMBL3770278)
Affinity DataEC50:  1.59E+3nM. Assay description: Agonist activity at human S1P1 receptor expressed in CHO-K1 EDG1 cells by beta-arrestin recruitment assay
In DepthDetails ArticlePubMed
TargetSphingosine 1-phosphate receptor 3(Homo sapiens (Human))
Glaxosmithkline
Curated by ChEMBL
LigandPNGBDBM50149555(CHEMBL3770278)
Affinity DataEC50: <3.16E+4nM. Assay description: Agonist activity at human S1P3 receptor expressed in RBL cells by [35S]GTP-gammaS accumulation assay
In DepthDetails ArticlePubMed
TargetSphingosine 1-phosphate receptor 1(Homo sapiens (Human))
Glaxosmithkline
Curated by ChEMBL
LigandPNGBDBM50149555(CHEMBL3770278)
Affinity DataEC50:  1.00E+3nM. Assay description: Agonist activity at human S1P1 receptor expressed in RH7777 cells by [35S]GTP-gammaS accumulation assay
In DepthDetails ArticlePubMed