BDBM50149709 5-Iodo-thiophene-2-carboxylic acid {4-[4-(2,3-dichloro-phenyl)-piperazin-1-yl]-butyl}-amide::CHEMBL362101
SMILES Clc1cccc(N2CCN(CCCCNC(=O)c3ccc(I)s3)CC2)c1Cl
InChI Key InChIKey=CPTTYKNXUVQTGN-UHFFFAOYSA-N
Data  6 KI
  Tab Delimited (TSV)   2D SDfile   Computed 3D by Vconf -m prep SDfile
Find this compound or compounds like it in BindingDB:
Activity Spreadsheet -- Enzyme Inhibition Constant Data from BindingDB
Found 6 hits for monomerid = 50149709
TargetD(3) dopamine receptor(Homo sapiens (Human))
University Of Erlangen-Nuremberg
Curated by ChEMBL
LigandPNGBDBM50149709(5-Iodo-thiophene-2-carboxylic acid {4-[4-(2,3-dich...)
Affinity DataKi:  1.40nM. Assay description: Binding affinity towards human D3 receptor using [3H]-spiperone expressed in CHO cells
In DepthDetails ArticlePubMed
Target5-hydroxytryptamine receptor 1A(Homo sapiens (Human))
University Of Erlangen-Nuremberg
Curated by ChEMBL
LigandPNGBDBM50149709(5-Iodo-thiophene-2-carboxylic acid {4-[4-(2,3-dich...)
Affinity DataKi:  24nM. Assay description: Binding affinity towards 5-HT1A receptor from porcine cortical membranes using [3H]-8-OH-DPAT
In DepthDetails ArticlePubMed
TargetD(2) dopamine receptor(Homo sapiens (Human))
University Of Erlangen-Nuremberg
Curated by ChEMBL
LigandPNGBDBM50149709(5-Iodo-thiophene-2-carboxylic acid {4-[4-(2,3-dich...)
Affinity DataKi:  32nM. Assay description: Binding affinity towards human D2 short receptor using [3H]-spiperone expressed in CHO cells
In DepthDetails ArticlePubMed
TargetD(2) dopamine receptor(Homo sapiens (Human))
University Of Erlangen-Nuremberg
Curated by ChEMBL
LigandPNGBDBM50149709(5-Iodo-thiophene-2-carboxylic acid {4-[4-(2,3-dich...)
Affinity DataKi:  89nM. Assay description: Binding affinity towards human D2 long receptor using [3H]-spiperone expressed in CHO cells
In DepthDetails ArticlePubMed
TargetD(4) dopamine receptor(Homo sapiens (Human))
University Of Erlangen-Nuremberg
Curated by ChEMBL
LigandPNGBDBM50149709(5-Iodo-thiophene-2-carboxylic acid {4-[4-(2,3-dich...)
Affinity DataKi:  130nM. Assay description: Binding affinity towards human D4.4 receptor using [3H]-spiperone expressed in CHO cells
In DepthDetails ArticlePubMed
TargetD(1A) dopamine receptor(Sus scrofa)
University Of Erlangen-Nuremberg
Curated by ChEMBL
LigandPNGBDBM50149709(5-Iodo-thiophene-2-carboxylic acid {4-[4-(2,3-dich...)
Affinity DataKi:  820nM. Assay description: Binding affinity towards D1 receptor from porcine striatal membranes using [3H]-SCH- 23390
In DepthDetails ArticlePubMed