BDBM50150002 CHEMBL184055::Phosphoric acid mono-{(R)-2-((Z)-octadec-9-enoylamino)-3-[4-(pyridin-3-ylmethoxy)-phenyl]-propyl} ester
SMILES CCCCCCCC\C=C/CCCCCCCC(=O)N[C@@H](COP(O)(O)=O)Cc1ccc(OCc2cccnc2)cc1
InChI Key InChIKey=KMTDWYLEJRZIJN-HWNQJZBBSA-N
Data  1 KI  1 IC50
  Tab Delimited (TSV)   2D SDfile   Computed 3D by Vconf -m prep SDfile
Find this compound or compounds like it in BindingDB:
Activity Spreadsheet -- Enzyme Inhibition Constant Data from BindingDB
Found 1 hit for monomerid = 50150002
TargetLysophosphatidic acid receptor 1(Homo sapiens (Human))
University Of Virginia
Curated by ChEMBL
LigandPNGBDBM50150002(CHEMBL184055 | Phosphoric acid mono-{(R)-2-((Z)-oc...)
Affinity DataIC50:  992nM. Assay description: Inhibitory concentration against Lysophosphatidic acid 1 (LPA1) receptor
In DepthDetails ArticlePubMed