BDBM50150637 CHEMBL3770653
SMILES OB(O)c1cccc(NC(=O)\C=C\c2ccc(Cl)cc2)c1
InChI Key InChIKey=IKPHFXMEHGWFQS-RMKNXTFCSA-N
Data  2 IC50
  Tab Delimited (TSV)   2D SDfile   Computed 3D by Vconf -m prep SDfile
Find this compound or compounds like it in BindingDB:
Activity Spreadsheet -- Enzyme Inhibition Constant Data from BindingDB
Found 2 hits for monomerid = 50150637
TargetFatty-acid amide hydrolase 1 [30-579](Rattus norvegicus (rat))
Sapienza University Of Rome
Curated by ChEMBL
LigandPNGBDBM50150637(CHEMBL3770653)
Affinity DataIC50: >1.00E+4nM. Assay description: Inhibition of rat brain FAAH assessed as hydrolysis of [14C]AEA to [14C]Ethanolamine incubated for 30 mins by scintillation counting method
In DepthDetails ArticlePubMed
TargetTransient receptor potential cation channel subfamily V member 1(Homo sapiens (Human))
Sapienza University Of Rome
Curated by ChEMBL
LigandPNGBDBM50150637(CHEMBL3770653)
Affinity DataIC50:  41nM. Assay description: Antagonist activity at recombinant human TRPV1 channel expressed in HEK293 cells assessed as inhibition of capsiacin-induced Ca2+ flux preincubated f...
In DepthDetails ArticlePubMed