BDBM50154970 2-{2-[3-fluoro-5-(pyridin-3-ylmethyl)phenyl]-2H-tetrazol-5-yl}pyridine::CHEMBL362724
SMILES Fc1cc(Cc2cccnc2)cc(c1)-n1nnc(n1)-c1ccccn1
InChI Key InChIKey=PGYVXLQSJJOPNT-UHFFFAOYSA-N
Data  1 KI  1 IC50
  Tab Delimited (TSV)   2D SDfile   Computed 3D by Vconf -m prep SDfile
Find this compound or compounds like it in BindingDB:
Activity Spreadsheet -- Enzyme Inhibition Constant Data from BindingDB
Found 2 hits for monomerid = 50154970
TargetMetabotropic glutamate receptor 5(Rattus norvegicus (Rat))
Merck Research Laboratories
Curated by ChEMBL
LigandPNGBDBM50154970(2-{2-[3-fluoro-5-(pyridin-3-ylmethyl)phenyl]-2H-te...)
Affinity DataKi:  38nM. Assay description: Binding affinity towards Metabotropic glutamate receptor was determined by displacing [3H]-3-methoxy-5-(pyridin-2-ylethynyl)pyridine from rat cortica...
In DepthDetails ArticlePubMed
TargetMetabotropic glutamate receptor 5(Homo sapiens (Human))
Merck Research Laboratories
Curated by ChEMBL
LigandPNGBDBM50154970(2-{2-[3-fluoro-5-(pyridin-3-ylmethyl)phenyl]-2H-te...)
Affinity DataIC50:  17nM. Assay description: Antagonistic activity of the compound against Metabotropic glutamate receptor 5 in [Ca2+] flux assay using glutamate (10 uM) as agonist
In DepthDetails ArticlePubMed