BDBM50155223 1-(5-Cyclobutyl-thiazol-2-yl)-3-(1H-indazol-7-yl)-urea::CHEMBL363283
SMILES O=C(Nc1ncc(s1)C1CCC1)Nc1cccc2c[nH]nc12
InChI Key InChIKey=YEWQGDMCRKBFBD-UHFFFAOYSA-N
Data  2 IC50
  Tab Delimited (TSV)   2D SDfile   Computed 3D by Vconf -m prep SDfile
Find this compound or compounds like it in BindingDB:
Activity Spreadsheet -- Enzyme Inhibition Constant Data from BindingDB
Found 2 hits for monomerid = 50155223
TargetCyclin-dependent kinase 2/G1/S-specific cyclin-E1(Homo sapiens (Human))
Pfizer
Curated by ChEMBL
LigandPNGBDBM50155223(1-(5-Cyclobutyl-thiazol-2-yl)-3-(1H-indazol-7-yl)-...)
Affinity DataIC50:  650nM. Assay description: Concentration required for inhibition of cyclin dependant kinase 2-cyclin E was measured by scintillation proximity assay
In DepthDetails ArticlePubMed
TargetCyclin-dependent kinase 5(Homo sapiens (Human))
Pfizer
Curated by ChEMBL
LigandPNGBDBM50155223(1-(5-Cyclobutyl-thiazol-2-yl)-3-(1H-indazol-7-yl)-...)
Affinity DataIC50:  190nM. Assay description: Concentration required for inhibition of cyclin-dependent kinase 5 was measured by scintillation proximity assay
In DepthDetails ArticlePubMed