BDBM50155232 1-(3H-Benzotriazol-4-yl)-3-(5-cyclobutyl-thiazol-2-yl)-urea::CHEMBL186371
SMILES O=C(Nc1ncc(s1)C1CCC1)Nc1cccc2nn[nH]c12
InChI Key InChIKey=PGVAPFNXIBFQNO-UHFFFAOYSA-N
Data  2 IC50
  Tab Delimited (TSV)   2D SDfile   Computed 3D by Vconf -m prep SDfile
Find this compound or compounds like it in BindingDB:
Activity Spreadsheet -- Enzyme Inhibition Constant Data from BindingDB
Found 2 hits for monomerid = 50155232
TargetCyclin-dependent kinase 5(Homo sapiens (Human))
Pfizer
Curated by ChEMBL
LigandPNGBDBM50155232(1-(3H-Benzotriazol-4-yl)-3-(5-cyclobutyl-thiazol-2...)
Affinity DataIC50:  41nM. Assay description: Concentration required for inhibition of cyclin-dependent kinase 5 was measured by scintillation proximity assay
In DepthDetails ArticlePubMed
TargetCyclin-dependent kinase 2/G1/S-specific cyclin-E1(Homo sapiens (Human))
Pfizer
Curated by ChEMBL
LigandPNGBDBM50155232(1-(3H-Benzotriazol-4-yl)-3-(5-cyclobutyl-thiazol-2...)
Affinity DataIC50:  106nM. Assay description: Concentration required for inhibition of cyclin dependant kinase 2-cyclin E was measured by scintillation proximity assay
In DepthDetails ArticlePubMed