BDBM50155851 CHEMBL3780706
SMILES CCN1C(=O)c2cccc3c(NS(=O)(=O)c4ccc(F)cc4Cl)ccc1c23
InChI Key InChIKey=JRNIXDMQFKHQLE-UHFFFAOYSA-N
Data  1 IC50
PDB links: 1 PDB ID matches this monomer.
  Tab Delimited (TSV)   2D SDfile   Computed 3D by Vconf -m prep SDfile
Find this compound or compounds like it in BindingDB:
Activity Spreadsheet -- Enzyme Inhibition Constant Data from BindingDB
Found 1 hit for monomerid = 50155851
TargetBromodomain-containing protein 4(Homo sapiens (Human))
Guangzhou Institutes Of Biomedicine And Health
Curated by ChEMBL
LigandPNGBDBM50155851(CHEMBL3780706)
Affinity DataIC50:  450nM. Assay description: Inhibition of human His6-tagged BRD4 bromodomain 1 (N44 to E168 residues) expressed in Escherichia coli BL21(DE3) cells using biotin-H4KAc4 as substr...